{"text_format":"1","workbook":"xlsx","n_sheets":4,"sheets":["Elolap","Tamogatastartalom","Szamitasok","Adatok"],"not_rendered":{"charts":0,"images":0,"macros":1,"external_links":1,"defined_names":104,"comments":1,"pivot_tables":0},"unopened":[],"bounds":{"document_bytes":16777216,"sheet_cells":100000,"rows_first":2000,"rows_last":500,"rows_between":2000,"halvings":0,"cell_chars":16384,"cell_head_chars":4096},"cells_cut":0,"cells_raw":0,"read":"whole","date_system":"1900"}

{"sheet":"Elolap","index":0,"n_rows":0,"n_cols":0,"rows_kept":0,"cut":false,"hidden":false,"merged":[]}

{"sheet":"Tamogatastartalom","index":1,"n_rows":210,"n_cols":47,"rows_kept":210,"cut":false,"hidden":false,"merged":[[3,5,3,7],[7,5,7,7],[5,5,5,7],[8,5,8,7],[5,1,5,2],[6,5,6,7],[4,5,4,7],[44,1,44,2],[2,46,3,46],[3,4,4,4],[2,19,3,19],[2,20,3,20],[2,43,2,44],[2,39,2,41],[2,21,2,24],[2,26,2,30],[2,36,2,38],[2,11,3,11],[2,12,3,12],[2,5,2,7],[4,19,5,20],[4,11,5,12],[3,1,3,2]]}
[]
[]
[null,"Ügyfél neve",null,null,null,"Hitelösszeg (EUR)",null,null,{"$f":"IF(C10=\"EUR\",+C11,C11/C12)","v":{"$error":"#DIV/0!"}},null,null,"Egyedi folyósítás dátuma","Folyósítás összege",null,null,null,null,null,null,"Egyedi törlesztés dátuma","Tőkeamortizáció egyedi törlesztés esetén","periódusközi kamatszámítás",null,null,null,null,"maradék kamatszámítás",null,null,null,null,null,null,null,null,null,"Piaci konstrukció",null,null,"Támogatott konstruckió",null,null,null,"Támogatástartalom",null,null,"Támogatástartalom + egyéb kedvezmények"]
[null,null,null,-0.04,null,"Ténylegesen felvett hitel támogatástartalma (EUR)",null,null,{"$f":"IF($C$10=\"EUR\",AU5,(AU5)/C12)","v":{"$error":"#DIV/0!"}},null,null,null,null,null,null,"kamat","támogatott",null,null,null,null,"dátumtól","tőke","kamat","támogatott",null,"dátumtól","amort","tőke","maradék","t maradék",null,null,null,"Periodus","Dátum","Tőke","Tőkeamt.","Kamatfiz.","Tőke","Tőkeamt.","Kamatfiz.",null,"FV","PV"]
[null,"Pénzügyi intézmény neve",null,null,null,{"$f":"\"Hitelösszeg (\"&C10&\")\"","v":"Hitelösszeg ()"},null,null,{"$f":"I3*C12","v":{"$error":"#DIV/0!"}},null,null,"A folyósítások összege kevesebb, mint a hitelösszeg",null,null,null,{"$f":"SUM(P7:P187)","v":0},{"$f":"SUM(Q7:Q187)","v":0},null,null,"A törlesztések összege nem egyezik meg a hitelösszeggel",null,null,null,{"$f":"SUM(X7:X187)","v":0},{"$f":"SUM(Y7:Y187)","v":0},null,null,null,null,{"$f":"SUM(AD7:AD187)","v":0},{"$f":"SUM(AE7:AE187)","v":0},null,null,null,null,null,{"$f":"+AK7","v":0},{"$f":"SUM(AL7:AL187)","v":0},{"$f":"SUM(AM7:AM187)","v":0},{"$f":"+AN7","v":0},{"$f":"SUM(AO7:AO187)","v":0},{"$f":"SUM(AP7:AP187)","v":0},null,{"$f":"SUM(AR7:AR187)","v":0},{"$f":"SUM(AS7:AS187)","v":0},null,{"$f":"AS5","v":0}]
[null,null,null,null,null,"Hitelre jutó támogatásintenzitás",null,null,{"$f":"IFERROR(I4*arfolyam/forintelszamolhato,0)","v":0},"Törlesztésiidőszak vége?",null,null,null,null,null,null,null,null,null,null,null,null,null,null,null,null,null,null,null,null,null,null,null,null,0,{"$f":"MAX(C25,MIN(L7:L210))","v":"00:00:00"}]
[null,null,null,null,null,"Kamatkedvezmény",null,null,{"$f":"MAX((C22-C28),0)","v":{"$error":"#N/A"}},{"$f":"AI7>$D$15","v":true},null,null,null,{"$f":"C25","v":"00:00:00"},{"$f":"IF(ISBLANK(L7),C11,0)","v":0},{"$f":"IF(AND(ISBLANK(L2),AH7<>1),0,IFERROR(-O7*piacikamat/365*(IF(ISBLANK(L7),$C$26,L7)-N7),\"\"))","v":""},{"$f":"IF(AND(ISBLANK(L2),AH7<>1),0,IFERROR(-O7*tenylegeskamat/365*(IF(ISBLANK(L7),$C$26,L7)-N7),\"\"))","v":0},{"$f":"IFERROR(IF(ISBLANK(L7),$C$26,L7)-N7,\"\")","v":0},null,null,null,{"$f":"IF(ISNA(MAX(T2,INDEX(AJ$6:AJ$210,MATCH(T7-1,AJ$6:AJ$210,1)))),\"\",MAX(T2,INDEX(AJ$6:AJ$210,MATCH(T7-1,AJ$6:AJ$210,1))))","v":""},{"$f":"IF(ISNA(MIN(IF(OR(ISBLANK(W6),W6=\"\"),INDEX(AK$7:AK$210,MATCH(T7,AJ$7:AJ$210,1)),W6-U2),INDEX(AK$7:AK$210,MATCH(T7,AJ$7:AJ$210,1)))),\"\",MIN(IF(OR(ISBLANK(W6),W6=\"\"),INDEX(AK$7:AK$210,MATCH(T7,AJ$7:AJ$210,1)),W6-U2),INDEX(AK$7:AK$210,MATCH(T7,AJ$7:AJ$210,1))))","v":0},{"$f":"IFERROR(-W7*piacikamat/365*(T7-V7),\"\")","v":""},{"$f":"IFERROR(-W7*tenylegeskamat/365*(T7-V7),\"\")","v":""},{"$f":"IFERROR(T7-V7,\"\")","v":""},{"$f":"MAX(AJ6,IF(ISNA(INDEX(T$7:T$210,MATCH(AJ7,T$7:T$210,1))),0,INDEX(T$7:T$210,MATCH(AJ7,T$7:T$210,1))))","v":"00:00:00"},{"$f":"IF(ISNA(INDEX(U$7:U$210,MATCH(AJ7,T$7:T$210,1))),0,INDEX(U$7:U$210,MATCH(AJ7,T$7:T$210,1)))","v":0},{"$f":"IF(ISNA(INDEX(W$7:W$210,MATCH(AJ7,T$7:T$210,1))),AK7,INDEX(W$7:W$210,MATCH(AJ7,T$7:T$210,1)))","v":0},{"$f":"IFERROR(-(AC7-AB7)*piacikamat/365*(AJ7-AA7),0)","v":0},{"$f":"IFERROR(-(AC7-AB7)*tenylegeskamat/365*(AJ7-AA7),0)","v":0},{"$f":"IFERROR(AJ7-AA7,\"\")","v":0},null,1,{"$f":"+IF(C27-C26<>0,1,\"\")","v":""},{"$f":"C26","v":"00:00:00"},{"$f":"IF(+C11<>0,C11,IF(AI7>0,C11*J7,\"\"))","v":0},{"$f":"IF(torlesztes=\"Egyedi\",-SUMIFS(U$7:U$210,T$7:T$210,\">\"&AJ6,T$7:T$210,\"<=\"&AJ7),IFERROR(IF(torlesztes=\"Egyenlő tőke\",IF(COUNT($AK$7:AK7)>$D$15,\"\",-$AK$5/$D$15),0),\"\"))","v":0},{"$f":"SUM(P7:P210)","v":0},{"$f":"+AK7","v":0},{"$f":"IF(torlesztes=\"Egyedi\",-SUMIFS(U$7:U$210,T$7:T$210,\">\"&AJ6,T$7:T$210,\"<=\"&AJ7),IFERROR(IF(torlesztes=\"Egyenlő tőke\",IF(COUNT($AN$7:AN7)>$D$15,\"\",-$AK$5/$D$15),0),\"\"))","v":0},{"$f":"SUM(Q7:Q210)","v":0},null,{"$f":"IFERROR(MAX((ABS(AM7)-ABS(AP7)),0),\"\")","v":0},{"$f":"IFERROR(AR7/(1+($C$16+1%)/365*(AJ7-C24)),\"\")","v":0},{"$f":"IFERROR(AJ7-AJ6,\"\")","v":0}]
[null,"Hitel típusa, devizaneme",null,null,null,"Adott beruházási költséghez kapcsolódó támogatás teljes összege (EUR)",null,null,{"$f":"I4+C48+C52+C56+C61+C54","v":{"$error":"#DIV/0!"}},{"$f":"AI8>$D$15","v":true},null,null,null,{"$f":"IF(ISBLANK(L7),\"\",L7)","v":""},{"$f":"IF(ISBLANK(L7),0,M7+O7)","v":0},{"$f":"IF(AND(ISBLANK(L7),AH8<>1),0,IFERROR(-O8*piacikamat/365*(IF(ISBLANK(L8),$C$26,L8)-N8),\"\"))","v":0},{"$f":"IF(AND(ISBLANK(L7),AH8<>1),0,IFERROR(-O8*tenylegeskamat/365*(IF(ISBLANK(L8),$C$26,L8)-N8),\"\"))","v":0},"",null,null,null,{"$f":"IF(ISNA(MAX(T7,INDEX(AJ$6:AJ$210,MATCH(T8-1,AJ$6:AJ$210,1)))),\"\",MAX(T7,INDEX(AJ$6:AJ$210,MATCH(T8-1,AJ$6:AJ$210,1))))","v":""},{"$f":"IF(ISNA(MIN(IF(OR(ISBLANK(W7),W7=\"\"),INDEX(AK$7:AK$210,MATCH(T8,AJ$7:AJ$210,1)),W7-U7),INDEX(AK$7:AK$210,MATCH(T8,AJ$7:AJ$210,1)))),\"\",MIN(IF(OR(ISBLANK(W7),W7=\"\"),INDEX(AK$7:AK$210,MATCH(T8,AJ$7:AJ$210,1)),W7-U7),INDEX(AK$7:AK$210,MATCH(T8,AJ$7:AJ$210,1))))","v":0},"","","","00:00:00",0,0,0,0,"",null,2,{"$f":"IF(COUNT(AJ8)=1,AI7+1,\"\")","v":""},{"$f":"IF(OR(AJ7=$C$27,AJ7=\"\"),\"\",IFERROR(IF(EDATE($C$26,(AH8-1)*12/$D$19)<=$C$27,EDATE($C$26,(AH8-1)*12/$D$19),$C$27),\"\"))","v":""},{"$f":"+IF(COUNT(AK7)<>0,SUM(AK7:AL7)*(1-J8),\"\")","v":0},{"$f":"IF(torlesztes=\"Egyedi\",-SUMIFS(U$7:U$210,T$7:T$210,\">\"&AJ7,T$7:T$210,\"<=\"&AJ8),IFERROR(IF(torlesztes=\"Egyenlő tőke\",IF(COUNT($AK$7:AK8)>$D$15,\"\",-$AK$5/$D$15),0),\"\"))","v":0},{"$f":"IF(torlesztes=\"Egyedi\",SUMIFS(X$7:X$210,T$7:T$210,\">\"&AJ7,T$7:T$210,\"<=\"&AJ8)+AD8,IFERROR(-AK8*piacikamat/365*(AJ8-AJ7),\"\"))","v":""},{"$f":"+IF(COUNT(AN7)<>0,SUM(AN7:AO7)*(1-J8),\"\")","v":0},{"$f":"IF(torlesztes=\"Egyedi\",-SUMIFS(U$7:U$210,T$7:T$210,\">\"&AJ7,T$7:T$210,\"<=\"&AJ8),IFERROR(IF(torlesztes=\"Egyenlő tőke\",IF(COUNT($AN$7:AN8)>$D$15,\"\",-$AK$5/$D$15),0),\"\"))","v":0},{"$f":"IF(torlesztes=\"Egyedi\",SUMIFS(Y$7:Y$210,T$7:T$210,\">\"&AJ7,T$7:T$210,\"<=\"&AJ8)+AE8,IFERROR(-AN8*tenylegeskamat/365*(AJ8-AJ7),\"\"))","v":""},null,{"$f":"IFERROR(MAX((ABS(AM8)-ABS(AP8)),0),\"\")","v":""},{"$f":"IFERROR(AR8/POWER(1+($C$16+1%)/$D$19,AI8-1)/(1+($C$16+1%)/365*($AJ$7-$C$24)),\"\")","v":""},""]
[null,"Hitel fajtája/célja","Beruházási hitel","Makrohoz kellenek (ne töröld ki!):",null,"Teljes (kumulált) támogatás intenzítása",null,null,{"$f":"I8*arfolyam/(forintelszamolhato)","v":{"$error":"#DIV/0!"}},true,null,null,null,{"$f":"IF(ISBLANK(L8),\"\",L8)","v":""},{"$f":"IF(ISBLANK(L8),0,M8+O8)","v":0},0,0,"",null,null,null,"",0,"","","","00:00:00",0,0,0,0,"",null,3,{"$f":"IF(COUNT(AJ9)=1,AI8+1,\"\")","v":""},"",0,{"$f":"IF(torlesztes=\"Egyedi\",-SUMIFS(U$7:U$210,T$7:T$210,\">\"&AJ8,T$7:T$210,\"<=\"&AJ9),IFERROR(IF(torlesztes=\"Egyenlő tőke\",IF(COUNT($AK$7:AK9)>$D$15,\"\",-$AK$5/$D$15),0),\"\"))","v":0},"",0,{"$f":"IF(torlesztes=\"Egyedi\",-SUMIFS(U$7:U$210,T$7:T$210,\">\"&AJ8,T$7:T$210,\"<=\"&AJ9),IFERROR(IF(torlesztes=\"Egyenlő tőke\",IF(COUNT($AN$7:AN9)>$D$15,\"\",-$AK$5/$D$15),0),\"\"))","v":0},"",null,"","",""]
[null,"Hitel devizaneme",null,{"$f":"+C22/D19","v":{"$error":"#N/A"}},null,null,null,null,null,true,null,null,null,"",0,0,0,"",null,null,null,"",0,"","","","00:00:00",0,0,0,0,"",null,4,{"$f":"IF(COUNT(AJ10)=1,AI9+1,\"\")","v":""},"",0,{"$f":"IF(torlesztes=\"Egyedi\",-SUMIFS(U$7:U$210,T$7:T$210,\">\"&AJ9,T$7:T$210,\"<=\"&AJ10),IFERROR(IF(torlesztes=\"Egyenlő tőke\",IF(COUNT($AK$7:AK10)>$D$15,\"\",-$AK$5/$D$15),0),\"\"))","v":0},"",0,{"$f":"IF(torlesztes=\"Egyedi\",-SUMIFS(U$7:U$210,T$7:T$210,\">\"&AJ9,T$7:T$210,\"<=\"&AJ10),IFERROR(IF(torlesztes=\"Egyenlő tőke\",IF(COUNT($AN$7:AN10)>$D$15,\"\",-$AK$5/$D$15),0),\"\"))","v":0},"",null,"","",""]
[null,{"$f":"\"Hitelösszeg (\"&C10&\")\"","v":"Hitelösszeg ()"},null,{"$f":"VLOOKUP(C19,Adatok!E4:H9,4,FALSE)/10000","v":{"$error":"#N/A"}},null,"Maximális támogatási mértékek",{"$f":"IF(OR(IF(ISERROR($I$9>G13),FALSE,$I$9>G13)),\"Nem jogosult\",IF($C$13/$C$12>30000000,\"Elérte a 30 millió eurót és emiatt nem finanszírozható\",\"\"))","v":{"$error":"#DIV/0!"}},{"$f":"IF(OR(IF(ISERROR($I$9>H13),FALSE,$I$9>H13)),\"Nem jogosult\",IF($C$13/$C$12>30000000,\"Elérte a 30 millió eurót és emiatt nem finanszírozható\",\"\"))","v":{"$error":"#DIV/0!"}},{"$f":"IF(OR(IF(ISERROR($I$9>I13),FALSE,$I$9>I13),C41=\"Nem éri el a 75%-ot\",C42=\"Nem\"),\"Nem jogosult\",IF(C41=\"Igen\", \"Egyedi intenzitás számítás szükséges\",IF($C$13/$C$12>30000000,\"Elérte a 30 millió eurót és emiatt nem finanszírozható\",\"\")))","v":{"$error":"#DIV/0!"}},true,null,null,null,"",0,0,0,"",null,null,null,"",0,"","","","00:00:00",0,0,0,0,"",null,5,"","",0,{"$f":"IF(torlesztes=\"Egyedi\",-SUMIFS(U$7:U$210,T$7:T$210,\">\"&AJ10,T$7:T$210,\"<=\"&AJ11),IFERROR(IF(torlesztes=\"Egyenlő tőke\",IF(COUNT($AK$7:AK11)>$D$15,\"\",-$AK$5/$D$15),0),\"\"))","v":0},"",0,{"$f":"IF(torlesztes=\"Egyedi\",-SUMIFS(U$7:U$210,T$7:T$210,\">\"&AJ10,T$7:T$210,\"<=\"&AJ11),IFERROR(IF(torlesztes=\"Egyenlő tőke\",IF(COUNT($AN$7:AN11)>$D$15,\"\",-$AK$5/$D$15),0),\"\"))","v":0},"",null,"","",""]
[null,{"$f":"\"EUR/\"&C10&\" árfolyam\"","v":"EUR/ árfolyam"},null,1E-4,null,null,"38a cikk","38 cikk","41 cikk",true,null,null,null,"",0,0,0,"",null,null,null,"",0,"","","","00:00:00",0,0,0,0,"",null,6,"","",0,{"$f":"IF(torlesztes=\"Egyedi\",-SUMIFS(U$7:U$210,T$7:T$210,\">\"&AJ11,T$7:T$210,\"<=\"&AJ12),IFERROR(IF(torlesztes=\"Egyenlő tőke\",IF(COUNT($AK$7:AK12)>$D$15,\"\",-$AK$5/$D$15),0),\"\"))","v":0},"",0,{"$f":"IF(torlesztes=\"Egyedi\",-SUMIFS(U$7:U$210,T$7:T$210,\">\"&AJ11,T$7:T$210,\"<=\"&AJ12),IFERROR(IF(torlesztes=\"Egyenlő tőke\",IF(COUNT($AN$7:AN12)>$D$15,\"\",-$AK$5/$D$15),0),\"\"))","v":0},"",null,"","",""]
[null,{"$f":"\"Elszámolható költségek (\"&C10&\")\"","v":"Elszámolható költségek ()"},null,null,null,"Maximális támogatásintenzitás (%)",{"$f":"IF(deminimiskizarok=0,\"Nem jogosult\",IF(C49<>\"ÁCSR 38 vagy 41-es jogcímen megítélt támogatás\",MIN(kalkulalt_alapintenzitas+Szamitasok!B13+Szamitasok!B15,C62),kalkulalt_alapintenzitas+Szamitasok!C13+Szamitasok!C15))","v":{"$error":"#N/A"}},{"$f":"IF(tizennegyeskizarok=0,\"Nem jogosult\",IF(C49<>\"ÁCSR 38 vagy 41-es jogcímen megítélt támogatás\",MIN(kalkulalt_alapintenzitas+Szamitasok!B13+Szamitasok!B15,C62),kalkulalt_alapintenzitas+Szamitasok!B13+Szamitasok!B15))/IF(C43=\"Nem\",2,1)","v":{"$error":"#N/A"}},{"$f":"IF(tizenheteskizarok=0,\"Nem jogosult\",IF(C49<>\"ÁCSR 38 vagy 41-es jogcímen megítélt támogatás\",MIN(kalkulalt_alapintenzitas+Szamitasok!B13,C62),kalkulalt_alapintenzitas+Szamitasok!B13))","v":{"$error":"#N/A"}},true,null,null,null,"",0,0,0,"",null,null,null,"",0,"","","","00:00:00",0,0,0,0,"",null,7,"","",0,{"$f":"IF(torlesztes=\"Egyedi\",-SUMIFS(U$7:U$210,T$7:T$210,\">\"&AJ12,T$7:T$210,\"<=\"&AJ13),IFERROR(IF(torlesztes=\"Egyenlő tőke\",IF(COUNT($AK$7:AK13)>$D$15,\"\",-$AK$5/$D$15),0),\"\"))","v":0},"",0,{"$f":"IF(torlesztes=\"Egyedi\",-SUMIFS(U$7:U$210,T$7:T$210,\">\"&AJ12,T$7:T$210,\"<=\"&AJ13),IFERROR(IF(torlesztes=\"Egyenlő tőke\",IF(COUNT($AN$7:AN13)>$D$15,\"\",-$AK$5/$D$15),0),\"\"))","v":0},"",null,"","",""]
[null,"Az ügylet Zöld fejlesztési célú?","Igen",null,null,"Maximális hitelösszeg (az igényelt hitel devizanemében)",{"$f":"IF(deminimiskizarok=0,\"Nem jogosult\",IF(I9>G13,\"Nem finanszírozható\",hitelpertamogatasarany*G15))","v":{"$error":"#DIV/0!"}},{"$f":"IF(tizennegyeskizarok=0,\"Nem jogosult\",IF(I9>H13,\"Nem finanszírozható\",hitelpertamogatasarany*H15))","v":{"$error":"#DIV/0!"}},{"$f":"IF(tizenheteskizarok=0,\"Nem jogosult\",IF(I9>I13,\"Nem finanszírozható\",hitelpertamogatasarany*I15))","v":{"$error":"#DIV/0!"}},true,null,null,null,"",0,0,0,"",null,null,null,"",0,"","","","00:00:00",0,0,0,0,"",null,8,"","",0,{"$f":"IF(torlesztes=\"Egyedi\",-SUMIFS(U$7:U$210,T$7:T$210,\">\"&AJ13,T$7:T$210,\"<=\"&AJ14),IFERROR(IF(torlesztes=\"Egyenlő tőke\",IF(COUNT($AK$7:AK14)>$D$15,\"\",-$AK$5/$D$15),0),\"\"))","v":0},"",0,{"$f":"IF(torlesztes=\"Egyedi\",-SUMIFS(U$7:U$210,T$7:T$210,\">\"&AJ13,T$7:T$210,\"<=\"&AJ14),IFERROR(IF(torlesztes=\"Egyenlő tőke\",IF(COUNT($AN$7:AN14)>$D$15,\"\",-$AK$5/$D$15),0),\"\"))","v":0},"",null,"","",""]
[null,"Piaci kamat meghatározása",null,{"$f":"COUNT(AI7:AI210)","v":0},null,"Maximális támogatástartalom (az igényelt hitel devizanemében)",{"$f":"IF(deminimiskizarok<>0,IF(I9>G13,\"Nem finanszírozható\",MAX(MAX((G13*(forintelszamolhato)-C52-C48),0)-C61,0)),\"Nem jogosult\")","v":{"$error":"#DIV/0!"}},{"$f":"IF(tizennegyeskizarok<>0,IF(I9>H13,\"Nem finanszírozható\",MAX(MAX((H13*(forintelszamolhato)-C54-C48),0)-C61,0)),\"Nem jogosult\")","v":{"$error":"#DIV/0!"}},{"$f":"IF(tizenheteskizarok<>0,IF(I9>I13,\"Nem finanszírozható\",MAX(MAX((I13*(forintelszamolhato)-C56-C48),0)-C61,0)),\"Nem jogosult\")","v":{"$error":"#DIV/0!"}},true,null,null,null,"",0,0,0,"",null,null,null,"",0,"","","","00:00:00",0,0,0,0,"",null,9,"","",0,{"$f":"IF(torlesztes=\"Egyedi\",-SUMIFS(U$7:U$210,T$7:T$210,\">\"&AJ14,T$7:T$210,\"<=\"&AJ15),IFERROR(IF(torlesztes=\"Egyenlő tőke\",IF(COUNT($AK$7:AK15)>$D$15,\"\",-$AK$5/$D$15),0),\"\"))","v":0},"",0,{"$f":"IF(torlesztes=\"Egyedi\",-SUMIFS(U$7:U$210,T$7:T$210,\">\"&AJ14,T$7:T$210,\"<=\"&AJ15),IFERROR(IF(torlesztes=\"Egyenlő tőke\",IF(COUNT($AN$7:AN15)>$D$15,\"\",-$AK$5/$D$15),0),\"\"))","v":0},"",null,"","",""]
[null,"Referencia alapkamat",null,null,null,null,null,null,null,true,null,null,null,"",0,0,0,"",null,null,null,"",0,"","","","00:00:00",0,0,0,0,"",null,10,{"$f":"IF(COUNT(AJ16)=1,AI15+1,\"\")","v":""},"",0,{"$f":"IF(torlesztes=\"Egyedi\",-SUMIFS(U$7:U$210,T$7:T$210,\">\"&AJ15,T$7:T$210,\"<=\"&AJ16),IFERROR(IF(torlesztes=\"Egyenlő tőke\",IF(COUNT($AK$7:AK16)>$D$15,\"\",-$AK$5/$D$15),0),\"\"))","v":0},"",0,{"$f":"IF(torlesztes=\"Egyedi\",-SUMIFS(U$7:U$210,T$7:T$210,\">\"&AJ15,T$7:T$210,\"<=\"&AJ16),IFERROR(IF(torlesztes=\"Egyenlő tőke\",IF(COUNT($AN$7:AN16)>$D$15,\"\",-$AK$5/$D$15),0),\"\"))","v":0},"",null,"","",""]
[null,"Van hitelfelvevői múltja vagy mérleg alapú hitelminősítése a hitelfelvevőnek?",null,null,null,null,null,null,null,true,null,null,null,"",0,0,0,"",null,null,null,"",0,"","","","00:00:00",0,0,0,0,"",null,11,{"$f":"IF(COUNT(AJ17)=1,AI16+1,\"\")","v":""},"",0,{"$f":"IF(torlesztes=\"Egyedi\",-SUMIFS(U$7:U$210,T$7:T$210,\">\"&AJ16,T$7:T$210,\"<=\"&AJ17),IFERROR(IF(torlesztes=\"Egyenlő tőke\",IF(COUNT($AK$7:AK17)>$D$15,\"\",-$AK$5/$D$15),0),\"\"))","v":0},"",0,{"$f":"IF(torlesztes=\"Egyedi\",-SUMIFS(U$7:U$210,T$7:T$210,\">\"&AJ16,T$7:T$210,\"<=\"&AJ17),IFERROR(IF(torlesztes=\"Egyenlő tőke\",IF(COUNT($AN$7:AN17)>$D$15,\"\",-$AK$5/$D$15),0),\"\"))","v":0},"",null,"","",""]
[null,"Cégbesorolás",null,null,null,null,null,null,null,true,null,null,null,"",0,0,0,"",null,null,null,"",0,"","","","00:00:00",0,0,0,0,"",null,12,"","",0,{"$f":"IF(torlesztes=\"Egyedi\",-SUMIFS(U$7:U$210,T$7:T$210,\">\"&AJ17,T$7:T$210,\"<=\"&AJ18),IFERROR(IF(torlesztes=\"Egyenlő tőke\",IF(COUNT($AK$7:AK18)>$D$15,\"\",-$AK$5/$D$15),0),\"\"))","v":0},"",0,{"$f":"IF(torlesztes=\"Egyedi\",-SUMIFS(U$7:U$210,T$7:T$210,\">\"&AJ17,T$7:T$210,\"<=\"&AJ18),IFERROR(IF(torlesztes=\"Egyenlő tőke\",IF(COUNT($AN$7:AN18)>$D$15,\"\",-$AK$5/$D$15),0),\"\"))","v":0},"",null,"","",""]
[null,"Adósminősítés",null,{"$f":"VLOOKUP($C$30,Adatok!R3:S5,2,0)","v":{"$error":"#N/A"}},null,null,null,null,null,true,null,null,null,"",0,0,0,"",null,null,null,"",0,"","","","00:00:00",0,0,0,0,"",null,13,"","",0,{"$f":"IF(torlesztes=\"Egyedi\",-SUMIFS(U$7:U$210,T$7:T$210,\">\"&AJ18,T$7:T$210,\"<=\"&AJ19),IFERROR(IF(torlesztes=\"Egyenlő tőke\",IF(COUNT($AK$7:AK19)>$D$15,\"\",-$AK$5/$D$15),0),\"\"))","v":0},"",0,{"$f":"IF(torlesztes=\"Egyedi\",-SUMIFS(U$7:U$210,T$7:T$210,\">\"&AJ18,T$7:T$210,\"<=\"&AJ19),IFERROR(IF(torlesztes=\"Egyenlő tőke\",IF(COUNT($AN$7:AN19)>$D$15,\"\",-$AK$5/$D$15),0),\"\"))","v":0},"",null,"","",""]
[null,"Fedezettség",null,null,null,null,null,null,null,true,null,null,null,"",0,0,0,"",null,null,null,"",0,"","","","00:00:00",0,0,0,0,"",null,14,"","",0,{"$f":"IF(torlesztes=\"Egyedi\",-SUMIFS(U$7:U$210,T$7:T$210,\">\"&AJ19,T$7:T$210,\"<=\"&AJ20),IFERROR(IF(torlesztes=\"Egyenlő tőke\",IF(COUNT($AK$7:AK20)>$D$15,\"\",-$AK$5/$D$15),0),\"\"))","v":0},"",0,{"$f":"IF(torlesztes=\"Egyedi\",-SUMIFS(U$7:U$210,T$7:T$210,\">\"&AJ19,T$7:T$210,\"<=\"&AJ20),IFERROR(IF(torlesztes=\"Egyenlő tőke\",IF(COUNT($AN$7:AN20)>$D$15,\"\",-$AK$5/$D$15),0),\"\"))","v":0},"",null,"","",""]
{"$rows_left_out":191}
{"sheet":"Szamitasok","index":2,"n_rows":25,"n_cols":22,"rows_kept":25,"cut":false,"hidden":true,"merged":[[19,0,19,8],[17,0,17,8],[21,0,21,8],[0,0,0,8],[2,0,2,1],[6,0,6,8],[7,0,7,8]]}
["Kizárók és KO-k"]
[null,null,null,"Váll. Méret","Halászat/akvakultúra",null,"Szélessávú infrasrtukúra","Kutatási infrastruktúra","Külföldi hálózathoz?","Mezőgazdasági termékek?",null,"Katonai berendezések","Fizetésképtelen?","Kollektív fizetésképtelen?","Nehéz helyzetben?",null,null,"A létesítményt bezárták",null,"Az üzletet piaci feltételek mellett bonyolítják le a vásárlást","Amennyiben immateriális eszköz beruházásáról van szó, akkor értékcsökkenést lehet rá elszámolni","Megkezdte a beruházást a hitelkérelem beadását megelőzően?"]
["Szorzó értéke",null,null,{"$f":"Tamogatastartalom!C32","v":0},"Nem",null,"Nem","Nem","Nem","Nem",null,"Nem","Nem","Nem",{"$f":"Tamogatastartalom!C34","v":0},null,null,"Nem releváns",null,"Igen","Nem releváns",{"$f":"Tamogatastartalom!C33","v":0}]
[{"$f":"PRODUCT(C4:W4)","v":1},"De minimis (38A?)",null,1,{"$f":"IF($E$3=\"Igen\",0,1)","v":1},null,{"$f":"IF(G3=\"Igen\",0,1)","v":1},null,{"$f":"IF($I$3=\"Igen\",0,1)","v":1},{"$f":"IF($J$3=\"Igen\",0,1)","v":1},null,{"$f":"IF($L$3=\"Igen\",0,1)","v":1},{"$f":"IF($M$3=\"Igen\",0,1)","v":1},{"$f":"IF($N$3=\"Igen\",0,1)","v":1},{"$f":"IF($O$3=\"Igen\",0,1)","v":1},null,null,null,null,null,null,{"$f":"IF($V$3=\"Igen\",0,1)","v":1}]
[{"$f":"PRODUCT(C5:W5)","v":1},"38as ",null,1,{"$f":"IF($E$3=\"Igen\",0,1)","v":1},null,{"$f":"IF(G3=\"Igen\",0,1)","v":1},{"$f":"IF(H3=\"Igen\",0,1)","v":1},{"$f":"IF($I$3=\"Igen\",0,1)","v":1},{"$f":"IF($J$3=\"Igen\",0,1)","v":1},null,{"$f":"IF($L$3=\"Igen\",0,1)","v":1},{"$f":"IF($M$3=\"Igen\",0,1)","v":1},{"$f":"IF($N$3=\"Igen\",0,1)","v":1},{"$f":"IF($O$3=\"Igen\",0,1)","v":1},null,null,{"$f":"IF($R$3=\"Nem\",0,1)","v":1},null,{"$f":"IF($T$3=\"Nem\",0,1)","v":1},{"$f":"IF($U$3=\"Nem\",0,1)","v":1},{"$f":"IF($V$3=\"Igen\",0,1)","v":1}]
[{"$f":"PRODUCT(C6:W6)","v":1},"41-es",null,1,{"$f":"IF($E$3=\"Igen\",0,1)","v":1},null,{"$f":"IF(G3=\"Igen\",0,1)","v":1},{"$f":"IF(H3=\"Igen\",0,1)","v":1},{"$f":"IF($I$3=\"Igen\",0,1)","v":1},{"$f":"IF($J$3=\"Igen\",0,1)","v":1},null,{"$f":"IF($L$3=\"Igen\",0,1)","v":1},{"$f":"IF($M$3=\"Igen\",0,1)","v":1},{"$f":"IF($N$3=\"Igen\",0,1)","v":1},{"$f":"IF($O$3=\"Igen\",0,1)","v":1},null,null,{"$f":"IF($R$3=\"Nem\",0,1)","v":1},null,{"$f":"IF($T$3=\"Nem\",0,1)","v":1},{"$f":"IF($U$3=\"Nem\",0,1)","v":1},{"$f":"IF($V$3=\"Igen\",0,1)","v":1}]
["14-es cikk",null,null,null,null,null,null,null,null,null,null,null,null,null,null,null,null,null,null,null,null,"E feletti mező biztos jó így?"]
["R szorzó értéke"]
["Elszámolható ktg-ek EUR-ban",{"$f":"Tamogatastartalom!C13/arfolyam","v":{"$error":"#DIV/0!"}}]
["A Elszámolható költségek",{"$f":"IF((B9-C10)>0,C10,B9)","v":{"$error":"#DIV/0!"}},50000000]
["B Elszámolható költségek",{"$f":"IF(B10<C10,0,IF(B9-C11<0,B9-C10,C10))","v":{"$error":"#DIV/0!"}},100000000]
["C elszámolható költségek","nincs!"]
["KKV bónusz",{"$f":"IF(D3=\"Mikró/Kis\",0.2,IF(D3=\"Közepes\",0.1,0))","v":0}]
["38a jógcím",{"$f":"VLOOKUP(Tamogatastartalom!C36,Adatok!A17:B22,2)","v":{"$error":"#N/A"}}]
["Régió bónusz",{"$f":"VLOOKUP(Tamogatastartalom!C35,Adatok!A12:B14,2,FALSE)","v":{"$error":"#N/A"}}]
["R szorzó értéke a támogatási térkép alapján",{"$f":"(B15+B13)","v":{"$error":"#N/A"}}]
[]
["17-es cikk"]
["Vállalatméret-szorzó",{"$f":"IF(D3=\"Közepes\",0.1,0)","v":0}]
[{"$f":"Tamogatastartalom!C10&\" érték\"","v":" érték"}]
{"$rows_left_out":6}
{"sheet":"Adatok","index":3,"n_rows":22,"n_cols":21,"rows_kept":22,"cut":false,"hidden":true,"merged":[[9,0,9,11],[0,14,0,24],[4,3,8,3],[1,3,1,7],[2,5,2,7],[0,0,0,11],[1,9,1,11]]}
["Felárak",null,null,null,null,null,null,null,null,null,null,null,null,null,"Segédszámítások"]
[null,null,null,"Piaci referencia",null,null,null,null,null,"Refin kamatok",null,null,null,null,"Törlesztés",null,null,"Törlesztésgyakoriság",null,null,"Select"]
[null,null,null,null,null,"Fedezettség",null,null,null,null,"EUR nem zöld/USD","HUF nem zöld","HUF zöld","EUR zöld","Egyenlő összeg",1,null,"Havi",12,null,"Beruházási hitel"]
[null,null,null,null,null,"Magas","Általános","Alacsony",null,null,null,null,null,null,"Egyenlő tőke",2,null,"Negyedéves",4,null,"Forgóeszközhitel"]
[null,null,null,"Hitelminősítés","Kiváló",60,75,100,null,null,null,null,null,null,"Egyedi",0,null,"Féléves",2,null,"Lízing/Eszköz alapú kölcsön"]
[null,null,null,null,"Jó",75,100,220,null,"Min",1,1,{"$f":"refkam-5%","v":-0.05},{"$f":"refkam-0.005","v":-5.0000000000000001E-3}]
[null,null,null,null,"Kielégítő",100,220,400,null,"Max",{"$f":"refkammin+4%","v":1.04},{"$f":"refkammin_1+4%","v":1.04},{"$f":"refkammin_2+4%","v":-1.0000000000000002E-2},{"$f":"refkammin_3+4%","v":3.5000000000000003E-2}]
[null,null,null,null,"Gyenge",220,400,650]
[null,null,null,null,"Rossz",400,650,1000]
["Regionális támogatási intenzitások"]
[null,"Nagyvállalat",null,null,null,null,null,null,"Nem kapcsolódik"]
["Select",0,null,null,null,null,null,null,"ÁCSR 38 vagy 41-es jogcímen megítélt támogatás",null,null,null,null,null,null,null,"Egyéb ÁCSR"]
["Budapest",0,null,null,null,null,null,null,"Egyéb jogcímen megítélt támogatás",null,null,null,null,null,null,null,"EMVA"]
["Vidék",0.15,null,null,null,null,null,null,"ÁCSR 38 vagy 41-es és Egyéb jogcímen megítélt támogatás",null,null,null,null,null,null,null,"Egyéb"]
[]
[null,"Alapintenzitás",null,"Kalkulált alapintenzitás"]
["Select",0,null,{"$f":"VLOOKUP(Tamogatastartalom!C36,A17:B22,2,FALSE)","v":{"$error":"#N/A"}},null,null,null,null,null," "]
["energiahatékonysági beruházás – gép, technológia",0.3]
["energiahatékonysági – ingatlan korszerűsítés 1 épületelem (pl. falszigetelés vagy tetőszigetelés)",0.25]
["ingatlan energiahatékonysági korszerűsítés – ingatlan (komplett)",{"$f":"IF(AND(Tamogatastartalom!C38=\"Igen\",Tamogatastartalom!C39=\"Igen\"),0.45,0.3)","v":0.3}]
{"$rows_left_out":2}